Target
Ephrin type-B receptor 4
Ligand
BDBM41477
Substrate
Meas. Tech.
Dose-response biochemical assay for antagonists of the interaction between the Eph receptor B4 (EphB4) and its ligand ephrin-B2 via TNYL-RAW peptide
IC50
>79400±n/a nM
Citation
 PubChem, PC Dose-response biochemical assay for antagonists of the interaction between the Eph receptor B4 (EphB4) and its ligand ephrin-B2 via TNYL-RAW peptide PubChem Bioassay (2007)[AID] 
Target
Name:
Ephrin type-B receptor 4
Synonyms:
EPHB4 Ephrin receptor HTK MYK1 Tyrosine-protein kinase TYRO11 | VHL/Ephrin type-B receptor 4
Type:
Enzyme
Mol. Mass.:
108273.51
Organism:
Homo sapiens (Human)
Description:
P54760
Residue:
987
  
Inhibitor
Name:
BDBM41477
Synonyms:
3-[[acetyl(benzyl)amino]methyl]-4-hydroxy-coumarilic acid ethyl ester MLS000105564 cid_1069130 ethyl 3-[[ethanoyl-(phenylmethyl)amino]methyl]-4-oxidanyl-1-benzofuran-2-carboxylate
Type:
Small organic molecule
Emp. Form.:
C21H21NO5
Mol. Mass.:
367.3951
SMILES:
CCOC(=O)c1oc2cccc(O)c2c1CN(Cc1ccccc1)C(C)=O
: