Target
Ephrin type-B receptor 4
Ligand
BDBM41490
Substrate
Meas. Tech.
Dose-response biochemical assay for antagonists of the interaction between the Eph receptor B4 (EphB4) and its ligand ephrin-B2 via TNYL-RAW peptide
IC50
>79400±n/a nM
Citation
 PubChem, PC Dose-response biochemical assay for antagonists of the interaction between the Eph receptor B4 (EphB4) and its ligand ephrin-B2 via TNYL-RAW peptide PubChem Bioassay (2007)[AID] 
Target
Name:
Ephrin type-B receptor 4
Synonyms:
EPHB4 Ephrin receptor HTK MYK1 Tyrosine-protein kinase TYRO11 | VHL/Ephrin type-B receptor 4
Type:
Enzyme
Mol. Mass.:
108273.51
Organism:
Homo sapiens (Human)
Description:
P54760
Residue:
987
  
Inhibitor
Name:
BDBM41490
Synonyms:
2-(4-tert-butylphenoxy)-N-(2-methyl-5-[1,3]oxazolo[5,4-b]pyridin-2-ylphenyl)acetamide 2-(4-tert-butylphenoxy)-N-[2-methyl-5-(2-oxazolo[5,4-b]pyridinyl)phenyl]acetamide 2-(4-tert-butylphenoxy)-N-[2-methyl-5-([1,3]oxazolo[5,4-b]pyridin-2-yl)phenyl]ethanamide SMR000141315 | cid_1369605
Type:
Small organic molecule
Emp. Form.:
C25H25N3O3
Mol. Mass.:
415.4843
SMILES:
Cc1ccc(cc1NC(=O)COc1ccc(cc1)C(C)(C)C)-c1nc2cccnc2o1
: