Target
Ephrin type-B receptor 4
Ligand
BDBM41493
Substrate
Meas. Tech.
Dose-response biochemical assay for antagonists of the interaction between the Eph receptor B4 (EphB4) and its ligand ephrin-B2 via TNYL-RAW peptide
IC50
>79400±n/a nM
Citation
 PubChem, PC Dose-response biochemical assay for antagonists of the interaction between the Eph receptor B4 (EphB4) and its ligand ephrin-B2 via TNYL-RAW peptide PubChem Bioassay (2007)[AID] 
Target
Name:
Ephrin type-B receptor 4
Synonyms:
EPHB4 Ephrin receptor HTK MYK1 Tyrosine-protein kinase TYRO11 | VHL/Ephrin type-B receptor 4
Type:
Enzyme
Mol. Mass.:
108273.51
Organism:
Homo sapiens (Human)
Description:
P54760
Residue:
987
  
Inhibitor
Name:
BDBM41493
Synonyms:
2-[3-[5-chloranyl-4-[(4-methylphenyl)amino]-6-oxidanylidene-pyridazin-1-yl]-1-adamantyl]ethanoic acid 2-[3-[5-chloro-4-(4-methylanilino)-6-oxopyridazin-1-yl]-1-adamantyl]acetic acid MLS000521765 cid_9551063
Type:
Small organic molecule
Emp. Form.:
C23H26ClN3O3
Mol. Mass.:
427.924
SMILES:
[H]C12CC3([H])CC(CC(O)=O)(C1)CC(C2)(C3)n1ncc(Nc2ccc(C)cc2)c(Cl)c1=O
: