Target
Ephrin type-B receptor 4
Ligand
BDBM41495
Substrate
Meas. Tech.
Dose-response biochemical assay for antagonists of the interaction between the Eph receptor B4 (EphB4) and its ligand ephrin-B2 via TNYL-RAW peptide
IC50
>79400±n/a nM
Citation
 PubChem, PC Dose-response biochemical assay for antagonists of the interaction between the Eph receptor B4 (EphB4) and its ligand ephrin-B2 via TNYL-RAW peptide PubChem Bioassay (2007)[AID] 
Target
Name:
Ephrin type-B receptor 4
Synonyms:
EPHB4 Ephrin receptor HTK MYK1 Tyrosine-protein kinase TYRO11 | VHL/Ephrin type-B receptor 4
Type:
Enzyme
Mol. Mass.:
108273.51
Organism:
Homo sapiens (Human)
Description:
P54760
Residue:
987
  
Inhibitor
Name:
BDBM41495
Synonyms:
MLS000520439 N-(1,3-benzodioxol-5-yl)-3-(4-fluorophenyl)-4,5-dihydro-1,2-oxazole-5-carboxamide SMR000130850 | cid_9551502
Type:
Small organic molecule
Emp. Form.:
C17H13FN2O4
Mol. Mass.:
328.2945
SMILES:
Fc1ccc(cc1)C1=NOC(C1)C(=O)Nc1ccc2OCOc2c1
: