Target
Ephrin type-B receptor 4
Ligand
BDBM41509
Substrate
Meas. Tech.
Dose-response biochemical assay for antagonists of the interaction between the Eph receptor B4 (EphB4) and its ligand ephrin-B2 via TNYL-RAW peptide
IC50
>79400±n/a nM
Citation
 PubChem, PC Dose-response biochemical assay for antagonists of the interaction between the Eph receptor B4 (EphB4) and its ligand ephrin-B2 via TNYL-RAW peptide PubChem Bioassay (2007)[AID] 
Target
Name:
Ephrin type-B receptor 4
Synonyms:
EPHB4 Ephrin receptor HTK MYK1 Tyrosine-protein kinase TYRO11 | VHL/Ephrin type-B receptor 4
Type:
Enzyme
Mol. Mass.:
108273.51
Organism:
Homo sapiens (Human)
Description:
P54760
Residue:
987
  
Inhibitor
Name:
BDBM41509
Synonyms:
3-(1,3-benzothiazol-2-ylhydrazo)-2-indolone 3-[2-(1,3-benzothiazol-2-yl)hydrazinyl]indol-2-one MLS000523183 cid_5494809
Type:
Small organic molecule
Emp. Form.:
C15H10N4OS
Mol. Mass.:
294.331
SMILES:
O=C1N=c2ccccc2=C1NNc1nc2ccccc2s1
: