Target
Ephrin type-B receptor 4
Ligand
BDBM41521
Substrate
Meas. Tech.
Dose-response biochemical assay for antagonists of the interaction between the Eph receptor B4 (EphB4) and its ligand ephrin-B2 via TNYL-RAW peptide
IC50
>79400±n/a nM
Citation
 PubChem, PC Dose-response biochemical assay for antagonists of the interaction between the Eph receptor B4 (EphB4) and its ligand ephrin-B2 via TNYL-RAW peptide PubChem Bioassay (2007)[AID] 
Target
Name:
Ephrin type-B receptor 4
Synonyms:
EPHB4 Ephrin receptor HTK MYK1 Tyrosine-protein kinase TYRO11 | VHL/Ephrin type-B receptor 4
Type:
Enzyme
Mol. Mass.:
108273.51
Organism:
Homo sapiens (Human)
Description:
P54760
Residue:
987
  
Inhibitor
Name:
BDBM41521
Synonyms:
(6E)-6-[[(5-sulfanylidene-3-thiophen-2-yl-1H-1,2,4-triazol-4-yl)amino]methylidene]-1-cyclohexa-2,4-dienone (6E)-6-[[[3-(2-thienyl)-5-thioxo-1H-1,2,4-triazol-4-yl]amino]methylene]cyclohexa-2,4-dien-1-one MLS000331335 cid_5707722
Type:
Small organic molecule
Emp. Form.:
C13H10N4OS2
Mol. Mass.:
302.375
SMILES:
Oc1ccccc1C=Nn1c(n[nH]c1=S)-c1cccs1
: