Target
Ephrin type-B receptor 4
Ligand
BDBM41526
Substrate
Meas. Tech.
Dose-response biochemical assay for antagonists of the interaction between the Eph receptor B4 (EphB4) and its ligand ephrin-B2 via TNYL-RAW peptide
IC50
>79400±n/a nM
Citation
 PubChem, PC Dose-response biochemical assay for antagonists of the interaction between the Eph receptor B4 (EphB4) and its ligand ephrin-B2 via TNYL-RAW peptide PubChem Bioassay (2007)[AID] 
Target
Name:
Ephrin type-B receptor 4
Synonyms:
EPHB4 Ephrin receptor HTK MYK1 Tyrosine-protein kinase TYRO11 | VHL/Ephrin type-B receptor 4
Type:
Enzyme
Mol. Mass.:
108273.51
Organism:
Homo sapiens (Human)
Description:
P54760
Residue:
987
  
Inhibitor
Name:
BDBM41526
Synonyms:
MLS000581136 N-(3-chloro-4-methyl-phenyl)-2-[2-keto-1-methyl-2-(p-phenetidino)ethoxy]benzamide N-(3-chloro-4-methylphenyl)-2-{2-[(4-ethoxyphenyl)amino]-1-methyl-2-oxoethoxy}benzamide cid_2961024
Type:
Small organic molecule
Emp. Form.:
C25H25ClN2O4
Mol. Mass.:
452.93
SMILES:
CCOc1ccc(NC(=O)C(C)Oc2ccccc2C(=O)Nc2ccc(C)c(Cl)c2)cc1
: