Target
Sphingosine 1-phosphate receptor 2
Ligand
BDBM37140
Substrate
Meas. Tech.
Dose Response Cell Based Assay for Antagonists of the S1P2 Receptor
IC50
4674±n/a nM
Citation
 PubChem, PC Dose Response Cell Based Assay for Antagonists of the S1P2 Receptor PubChem Bioassay (2007)[AID] 
Target
Name:
Sphingosine 1-phosphate receptor 2
Synonyms:
EDG5 S1PR2 Sphingosine 1-phosphate receptor Sphingosine-1-phosphate receptor 2 | ndothelial differentiation G-protein coupled receptor 5
Type:
G Protein-Coupled Receptor (GPCR)
Mol. Mass.:
38883.16
Organism:
Homo sapiens (Human)
Description:
Membranes isolated from S1P2-transfected CHO cells were used in ligand binding assay.
Residue:
353
  
Inhibitor
Name:
BDBM37140
Synonyms:
MLS000096729 N-[4-(4-butanoylpiperazin-1-yl)-3-chloranyl-phenyl]-1-benzofuran-2-carboxamide N-[4-(4-butyryl-1-piperazinyl)-3-chlorophenyl]-1-benzofuran-2-carboxamide SMR000074009 | cid_2944643
Type:
Small organic molecule
Emp. Form.:
C23H24ClN3O3
Mol. Mass.:
425.908
SMILES:
CCCC(=O)N1CCN(CC1)c1ccc(NC(=O)c2cc3ccccc3o2)cc1Cl
: