Target
Sphingosine 1-phosphate receptor 2
Ligand
BDBM41585
Substrate
Meas. Tech.
Dose Response Cell Based Assay for Antagonists of the S1P2 Receptor
IC50
3798±n/a nM
Citation
 PubChem, PC Dose Response Cell Based Assay for Antagonists of the S1P2 Receptor PubChem Bioassay (2007)[AID] 
Target
Name:
Sphingosine 1-phosphate receptor 2
Synonyms:
EDG5 S1PR2 Sphingosine 1-phosphate receptor Sphingosine-1-phosphate receptor 2 | ndothelial differentiation G-protein coupled receptor 5
Type:
G Protein-Coupled Receptor (GPCR)
Mol. Mass.:
38883.16
Organism:
Homo sapiens (Human)
Description:
Membranes isolated from S1P2-transfected CHO cells were used in ligand binding assay.
Residue:
353
  
Inhibitor
Name:
BDBM41585
Synonyms:
(E)-4,4-dimethyl-1-(3-nitrophenyl)-2-(1,2,4-triazol-1-yl)-1-penten-3-one 4,4-Dimethyl-1-(3-nitro-phenyl)-2-[1,2,4]triazol-1-yl-pent-1-en-3-one SMR000117706 | cid_5759185
Type:
Small organic molecule
Emp. Form.:
C15H16N4O3
Mol. Mass.:
300.3125
SMILES:
CC(C)(C)C(=O)C(=C/c1cccc(c1)[N+]([O-])=O)\n1cncn1
: