Target
Sphingosine 1-phosphate receptor 2
Ligand
BDBM41601
Substrate
Meas. Tech.
Dose Response Cell Based Assay for Antagonists of the S1P2 Receptor
IC50
4374±n/a nM
Citation
 PubChem, PC Dose Response Cell Based Assay for Antagonists of the S1P2 Receptor PubChem Bioassay (2007)[AID] 
Target
Name:
Sphingosine 1-phosphate receptor 2
Synonyms:
EDG5 S1PR2 Sphingosine 1-phosphate receptor Sphingosine-1-phosphate receptor 2 | ndothelial differentiation G-protein coupled receptor 5
Type:
G Protein-Coupled Receptor (GPCR)
Mol. Mass.:
38883.16
Organism:
Homo sapiens (Human)
Description:
Membranes isolated from S1P2-transfected CHO cells were used in ligand binding assay.
Residue:
353
  
Inhibitor
Name:
BDBM41601
Synonyms:
4-(10-Methyl-8-phenyl-6-m-tolylamino-8,11-dihydro-5,7,8,9,11a-pentaaza-cyclopenta[b]phenanthren-11 -yl)-benzene-1,2-diol SMR000145384 | cid_3449225
Type:
Small organic molecule
Emp. Form.:
C32H26N6O2
Mol. Mass.:
526.5878
SMILES:
Cc1nn(c2N=C3N(C(c12)c1ccc(O)c(O)c1)c1ccccc1N=C3Nc1cccc(C)c1)-c1ccccc1
: