Target
Sphingosine 1-phosphate receptor 2
Ligand
BDBM41606
Substrate
Meas. Tech.
Dose Response Cell Based Assay for Antagonists of the S1P2 Receptor
IC50
682±n/a nM
Citation
 PubChem, PC Dose Response Cell Based Assay for Antagonists of the S1P2 Receptor PubChem Bioassay (2007)[AID] 
Target
Name:
Sphingosine 1-phosphate receptor 2
Synonyms:
EDG5 S1PR2 Sphingosine 1-phosphate receptor Sphingosine-1-phosphate receptor 2 | ndothelial differentiation G-protein coupled receptor 5
Type:
G Protein-Coupled Receptor (GPCR)
Mol. Mass.:
38883.16
Organism:
Homo sapiens (Human)
Description:
Membranes isolated from S1P2-transfected CHO cells were used in ligand binding assay.
Residue:
353
  
Inhibitor
Name:
BDBM41606
Synonyms:
MLS000324745 N-[1,1,1,3,3,3-hexakis(fluoranyl)-2-[(6-nitro-1,3-benzothiazol-2-yl)amino]propan-2-yl]benzamide N-[2,2,2-trifluoro-1-[(6-nitro-1,3-benzothiazol-2-yl)amino]-1-(trifluoromethyl)ethyl]benzamide cid_570353
Type:
Small organic molecule
Emp. Form.:
C17H10F6N4O3S
Mol. Mass.:
464.342
SMILES:
[O-][N+](=O)c1ccc2nc(NC(NC(=O)c3ccccc3)(C(F)(F)F)C(F)(F)F)sc2c1
: