Target
Sphingosine 1-phosphate receptor 2
Ligand
BDBM41633
Substrate
Meas. Tech.
Dose Response Cell Based Assay for Antagonists of the S1P2 Receptor
IC50
>30000±n/a nM
Citation
 PubChem, PC Dose Response Cell Based Assay for Antagonists of the S1P2 Receptor PubChem Bioassay (2007)[AID] 
Target
Name:
Sphingosine 1-phosphate receptor 2
Synonyms:
EDG5 S1PR2 Sphingosine 1-phosphate receptor Sphingosine-1-phosphate receptor 2 | ndothelial differentiation G-protein coupled receptor 5
Type:
G Protein-Coupled Receptor (GPCR)
Mol. Mass.:
38883.16
Organism:
Homo sapiens (Human)
Description:
Membranes isolated from S1P2-transfected CHO cells were used in ligand binding assay.
Residue:
353
  
Inhibitor
Name:
BDBM41633
Synonyms:
3-(3-pyridinyl)-6-(trifluoromethyl)-2-thieno[3,2-b]pyridinecarboxylic acid 3-pyridin-3-yl-6-(trifluoromethyl)thieno[3,2-b]pyridine-2-carboxylic acid cid_1486466
Type:
Small organic molecule
Emp. Form.:
C14H7F3N2O2S
Mol. Mass.:
324.278
SMILES:
OC(=O)c1sc2cc(cnc2c1-c1cccnc1)C(F)(F)F
: