Target
Sphingosine 1-phosphate receptor 2
Ligand
BDBM41662
Substrate
Meas. Tech.
Dose Response Cell Based Assay for Agonists of the S1P2 Receptor
EC50
>50000±n/a nM
Citation
 PubChem, PC Dose Response Cell Based Assay for Agonists of the S1P2 Receptor PubChem Bioassay (2007)[AID] 
Target
Name:
Sphingosine 1-phosphate receptor 2
Synonyms:
EDG5 S1PR2 Sphingosine 1-phosphate receptor Sphingosine-1-phosphate receptor 2 | ndothelial differentiation G-protein coupled receptor 5
Type:
G Protein-Coupled Receptor (GPCR)
Mol. Mass.:
38883.16
Organism:
Homo sapiens (Human)
Description:
Membranes isolated from S1P2-transfected CHO cells were used in ligand binding assay.
Residue:
353
  
Inhibitor
Name:
BDBM41662
Synonyms:
2-(4-morpholinyl)-2-oxo-N-[(1-phenylcyclopentyl)methyl]acetamide 2-keto-2-morpholino-N-[(1-phenylcyclopentyl)methyl]acetamide 2-morpholin-4-yl-2-oxo-N-[(1-phenylcyclopentyl)methyl]acetamide SMR000119204 | cid_2296431
Type:
Small organic molecule
Emp. Form.:
C18H24N2O3
Mol. Mass.:
316.3948
SMILES:
O=C(NCC1(CCCC1)c1ccccc1)C(=O)N1CCOCC1
: