Target
Sphingosine 1-phosphate receptor 2
Ligand
BDBM41669
Substrate
Meas. Tech.
Dose Response Cell Based Assay for Agonists of the S1P2 Receptor
EC50
338±n/a nM
Citation
 PubChem, PC Dose Response Cell Based Assay for Agonists of the S1P2 Receptor PubChem Bioassay (2007)[AID] 
Target
Name:
Sphingosine 1-phosphate receptor 2
Synonyms:
EDG5 S1PR2 Sphingosine 1-phosphate receptor Sphingosine-1-phosphate receptor 2 | ndothelial differentiation G-protein coupled receptor 5
Type:
G Protein-Coupled Receptor (GPCR)
Mol. Mass.:
38883.16
Organism:
Homo sapiens (Human)
Description:
Membranes isolated from S1P2-transfected CHO cells were used in ligand binding assay.
Residue:
353
  
Inhibitor
Name:
BDBM41669
Synonyms:
4-[3-(4-chlorophenyl)-2-pyrazolin-1-yl]-N-[3-(dimethylamino)propyl]benzenesulfonamide 4-[5-(4-chlorophenyl)-3,4-dihydropyrazol-2-yl]-N-[3-(dimethylamino)propyl]benzenesulfonamide SMR000135230 | cid_2837694
Type:
Small organic molecule
Emp. Form.:
C20H25ClN4O2S
Mol. Mass.:
420.956
SMILES:
CN(C)CCCNS(=O)(=O)c1ccc(cc1)N1CCC(=N1)c1ccc(Cl)cc1
: