Target
Sphingosine 1-phosphate receptor 2
Ligand
BDBM41696
Substrate
Meas. Tech.
Dose Response Cell Based Assay for Agonists of the S1P2 Receptor of Purchased Analogues
EC50
>30000±n/a nM
Citation
 PubChem, PC Dose Response Cell Based Assay for Agonists of the S1P2 Receptor of Purchased Analogues PubChem Bioassay (2007)[AID] 
Target
Name:
Sphingosine 1-phosphate receptor 2
Synonyms:
EDG5 S1PR2 Sphingosine 1-phosphate receptor Sphingosine-1-phosphate receptor 2 | ndothelial differentiation G-protein coupled receptor 5
Type:
G Protein-Coupled Receptor (GPCR)
Mol. Mass.:
38883.16
Organism:
Homo sapiens (Human)
Description:
Membranes isolated from S1P2-transfected CHO cells were used in ligand binding assay.
Residue:
353
  
Inhibitor
Name:
BDBM41696
Synonyms:
7-[2-(1-benzyl-2,5-dimethyl-pyrrol-3-yl)-2-keto-ethyl]-1,3-dimethyl-xanthine 7-[2-[2,5-dimethyl-1-(phenylmethyl)-3-pyrrolyl]-2-oxoethyl]-1,3-dimethylpurine-2,6-dione SR-01000759079-1 | cid_4828104
Type:
Small organic molecule
Emp. Form.:
C22H23N5O3
Mol. Mass.:
405.4497
SMILES:
Cc1cc(C(=O)Cn2cnc3n(C)c(=O)n(C)c(=O)c23)c(C)n1Cc1ccccc1
: