Target
Sphingosine 1-phosphate receptor 2
Ligand
BDBM41697
Substrate
Meas. Tech.
Dose Response Cell Based Assay for Agonists of the S1P2 Receptor of Purchased Analogues
EC50
22280±n/a nM
Citation
 PubChem, PC Dose Response Cell Based Assay for Agonists of the S1P2 Receptor of Purchased Analogues PubChem Bioassay (2007)[AID] 
Target
Name:
Sphingosine 1-phosphate receptor 2
Synonyms:
EDG5 S1PR2 Sphingosine 1-phosphate receptor Sphingosine-1-phosphate receptor 2 | ndothelial differentiation G-protein coupled receptor 5
Type:
G Protein-Coupled Receptor (GPCR)
Mol. Mass.:
38883.16
Organism:
Homo sapiens (Human)
Description:
Membranes isolated from S1P2-transfected CHO cells were used in ligand binding assay.
Residue:
353
  
Inhibitor
Name:
BDBM41697
Synonyms:
1-[2-(1-benzyl-2,5-dimethyl-pyrrol-3-yl)-2-keto-ethyl]-3-methyl-imidazolidine-2,4,5-trione 1-[2-[2,5-dimethyl-1-(phenylmethyl)-3-pyrrolyl]-2-oxoethyl]-3-methylimidazolidine-2,4,5-trione SR-01000759080-1 | cid_7756956
Type:
Small organic molecule
Emp. Form.:
C19H19N3O4
Mol. Mass.:
353.3719
SMILES:
CN1C(=O)N(CC(=O)c2cc(C)n(Cc3ccccc3)c2C)C(=O)C1=O
: