Target
Sphingosine 1-phosphate receptor 2
Ligand
BDBM41703
Substrate
Meas. Tech.
Dose Response Cell Based Assay for Agonists of the S1P2 Receptor of Purchased Analogues
EC50
>30000±n/a nM
Citation
 PubChem, PC Dose Response Cell Based Assay for Agonists of the S1P2 Receptor of Purchased Analogues PubChem Bioassay (2007)[AID] 
Target
Name:
Sphingosine 1-phosphate receptor 2
Synonyms:
EDG5 S1PR2 Sphingosine 1-phosphate receptor Sphingosine-1-phosphate receptor 2 | ndothelial differentiation G-protein coupled receptor 5
Type:
G Protein-Coupled Receptor (GPCR)
Mol. Mass.:
38883.16
Organism:
Homo sapiens (Human)
Description:
Membranes isolated from S1P2-transfected CHO cells were used in ligand binding assay.
Residue:
353
  
Inhibitor
Name:
BDBM41703
Synonyms:
1-(1-benzyl-2,5-dimethyl-pyrrol-3-yl)-2-[(1-cyclopropyltetrazol-5-yl)thio]ethanone 2-[(1-cyclopropyl-1,2,3,4-tetrazol-5-yl)sulfanyl]-1-[2,5-dimethyl-1-(phenylmethyl)pyrrol-3-yl]ethanone SR-01000759093-1 | cid_9362718
Type:
Small organic molecule
Emp. Form.:
C19H21N5OS
Mol. Mass.:
367.468
SMILES:
Cc1cc(C(=O)CSc2nnnn2C2CC2)c(C)n1Cc1ccccc1
: