Target
Serine/threonine-protein kinase PLK1
Ligand
BDBM41770
Substrate
Meas. Tech.
Concentration Response Redox Cycling H2O2 Generation assay to characterize small molecule inhibitors identified in the Polo box domain (PBD) of Plk1 Primary HTS.
EC50
>50000±n/a nM
Citation
 PubChem, PC Concentration Response Redox Cycling H2O2 Generation assay to characterize small molecule inhibitors identified in the Polo box domain (PBD) of Plk1 Primary HTS. PubChem Bioassay (2007)[AID] 
Target
Name:
Serine/threonine-protein kinase PLK1
Synonyms:
PLK PLK1 Polo-like kinase 1 (PlK1) STPK13 Serine/threonine-protein kinase 13 | polo-like kinase
Type:
Serine/threonine-protein kinase
Mol. Mass.:
68277.16
Organism:
Homo sapiens (Human)
Description:
P53350
Residue:
603
  
Inhibitor
Name:
BDBM41770
Synonyms:
1',3'-dimethylspiro[benzothiophene-2,5'-hexahydropyrimidine]-2',3,4',6'-diquinone MLS000055669 cid_2324605
Type:
Small organic molecule
Emp. Form.:
C13H10N2O4S
Mol. Mass.:
290.295
SMILES:
CN1C(=O)N(C)C(=O)C2(Sc3ccccc3C2=O)C1=O
: