Target
Serine/threonine-protein kinase PLK1
Ligand
BDBM37501
Substrate
Meas. Tech.
Concentration Response Redox Cycling H2O2 Generation assay to characterize small molecule inhibitors identified in the Polo box domain (PBD) of Plk1 Primary HTS.
EC50
>50000±n/a nM
Citation
 PubChem, PC Concentration Response Redox Cycling H2O2 Generation assay to characterize small molecule inhibitors identified in the Polo box domain (PBD) of Plk1 Primary HTS. PubChem Bioassay (2007)[AID] 
Target
Name:
Serine/threonine-protein kinase PLK1
Synonyms:
PLK PLK1 Polo-like kinase 1 (PlK1) STPK13 Serine/threonine-protein kinase 13 | polo-like kinase
Type:
Serine/threonine-protein kinase
Mol. Mass.:
68277.16
Organism:
Homo sapiens (Human)
Description:
P53350
Residue:
603
  
Inhibitor
Name:
BDBM37501
Synonyms:
4-(dimethylamino)-N-(4,5,6,7-tetrahydro-1,3-benzothiazol-2-yl)benzamide SMR000017424 | cid_746147
Type:
Small organic molecule
Emp. Form.:
C16H19N3OS
Mol. Mass.:
301.407
SMILES:
CN(C)c1ccc(cc1)C(=O)Nc1nc2CCCCc2s1
: