Target
Serine/threonine-protein kinase PLK1
Ligand
BDBM41813
Substrate
Meas. Tech.
Concentration Response Redox Cycling H2O2 Generation assay to characterize small molecule inhibitors identified in the Polo box domain (PBD) of Plk1 Primary HTS.
EC50
>50000±n/a nM
Citation
 PubChem, PC Concentration Response Redox Cycling H2O2 Generation assay to characterize small molecule inhibitors identified in the Polo box domain (PBD) of Plk1 Primary HTS. PubChem Bioassay (2007)[AID] 
Target
Name:
Serine/threonine-protein kinase PLK1
Synonyms:
PLK PLK1 Polo-like kinase 1 (PlK1) STPK13 Serine/threonine-protein kinase 13 | polo-like kinase
Type:
Serine/threonine-protein kinase
Mol. Mass.:
68277.16
Organism:
Homo sapiens (Human)
Description:
P53350
Residue:
603
  
Inhibitor
Name:
BDBM41813
Synonyms:
1-piperidinyl-[4-(1-tetrazolyl)phenyl]methanone Piperidin-1-yl-(4-tetrazol-1-yl-phenyl)-methanone cid_817486 piperidin-1-yl-[4-(tetrazol-1-yl)phenyl]methanone | piperidino-[4-(tetrazol-1-yl)phenyl]methanone
Type:
Small organic molecule
Emp. Form.:
C13H15N5O
Mol. Mass.:
257.2911
SMILES:
O=C(N1CCCCC1)c1ccc(cc1)-n1cnnn1
: