Target
Serine/threonine-protein kinase PLK1
Ligand
BDBM41760
Substrate
Meas. Tech.
Concentration Response fluorescence polarization-based assay to confirm small molecule inhibitors identified in the Polo box domain (PBD) of Plk1 Primary HTS.
IC50
>50000±n/a nM
Citation
 PubChem, PC Concentration Response fluorescence polarization-based assay to confirm small molecule inhibitors identified in the Polo box domain (PBD) of Plk1 Primary HTS. PubChem Bioassay (2007)[AID] 
Target
Name:
Serine/threonine-protein kinase PLK1
Synonyms:
PLK PLK1 Polo-like kinase 1 (PlK1) STPK13 Serine/threonine-protein kinase 13 | polo-like kinase
Type:
Serine/threonine-protein kinase
Mol. Mass.:
68277.16
Organism:
Homo sapiens (Human)
Description:
P53350
Residue:
603
  
Inhibitor
Name:
BDBM41760
Synonyms:
3-Oxo-1-phenyl-cyclopentanecarboxylic acid 3-oxidanylidene-1-phenyl-cyclopentane-1-carboxylic acid 3-oxo-1-phenylcyclopentane-1-carboxylic acid SMR000009429 | cid_655176
Type:
Small organic molecule
Emp. Form.:
C12H12O3
Mol. Mass.:
204.2219
SMILES:
OC(=O)C1(CCC(=O)C1)c1ccccc1
: