Target
Serine/threonine-protein kinase PLK1
Ligand
BDBM41797
Substrate
Meas. Tech.
Concentration Response fluorescence polarization-based assay to confirm small molecule inhibitors identified in the Polo box domain (PBD) of Plk1 Primary HTS.
IC50
>50000±n/a nM
Citation
 PubChem, PC Concentration Response fluorescence polarization-based assay to confirm small molecule inhibitors identified in the Polo box domain (PBD) of Plk1 Primary HTS. PubChem Bioassay (2007)[AID] 
Target
Name:
Serine/threonine-protein kinase PLK1
Synonyms:
PLK PLK1 Polo-like kinase 1 (PlK1) STPK13 Serine/threonine-protein kinase 13 | polo-like kinase
Type:
Serine/threonine-protein kinase
Mol. Mass.:
68277.16
Organism:
Homo sapiens (Human)
Description:
P53350
Residue:
603
  
Inhibitor
Name:
BDBM41797
Synonyms:
5-(benzoxymethyl)uracil 5-[(benzyloxy)methyl]-2,4(1H,3H)-pyrimidinedione SMR000069595 | cid_309850
Type:
Small organic molecule
Emp. Form.:
C12H12N2O3
Mol. Mass.:
232.2353
SMILES:
O=c1[nH]cc(COCc2ccccc2)c(=O)[nH]1
: