Target
Serine/threonine-protein kinase PLK1
Ligand
BDBM50099737
Substrate
Meas. Tech.
Concentration Response fluorescence polarization-based assay to confirm small molecule inhibitors identified in the Polo box domain (PBD) of Plk1 Primary HTS.
IC50
5899.000168±n/a nM
Citation
 PubChem, PC Concentration Response fluorescence polarization-based assay to confirm small molecule inhibitors identified in the Polo box domain (PBD) of Plk1 Primary HTS. PubChem Bioassay (2007)[AID] 
Target
Name:
Serine/threonine-protein kinase PLK1
Synonyms:
PLK PLK1 Polo-like kinase 1 (PlK1) STPK13 Serine/threonine-protein kinase 13 | polo-like kinase
Type:
Serine/threonine-protein kinase
Mol. Mass.:
68277.16
Organism:
Homo sapiens (Human)
Description:
P53350
Residue:
603
  
Inhibitor
Name:
BDBM50099737
Synonyms:
2-Amino-phenanthrene-9,10-dione US9073941, 902 | cid_254021
Type:
Small organic molecule
Emp. Form.:
C14H9NO2
Mol. Mass.:
223.2268
SMILES:
Nc1ccc-2c(c1)C(=O)C(=O)c1ccccc-21
: