Target
Serine/threonine-protein kinase PLK1
Ligand
BDBM41820
Substrate
Meas. Tech.
Concentration Response fluorescence polarization-based assay to confirm small molecule inhibitors identified in the Polo box domain (PBD) of Plk1 Primary HTS.
IC50
>50000±n/a nM
Citation
 PubChem, PC Concentration Response fluorescence polarization-based assay to confirm small molecule inhibitors identified in the Polo box domain (PBD) of Plk1 Primary HTS. PubChem Bioassay (2007)[AID] 
Target
Name:
Serine/threonine-protein kinase PLK1
Synonyms:
PLK PLK1 Polo-like kinase 1 (PlK1) STPK13 Serine/threonine-protein kinase 13 | polo-like kinase
Type:
Serine/threonine-protein kinase
Mol. Mass.:
68277.16
Organism:
Homo sapiens (Human)
Description:
P53350
Residue:
603
  
Inhibitor
Name:
BDBM41820
Synonyms:
4-(2,6-dimethylanilino)-7,7-dimethyl-1-phenyl-8-oxa-1,3-diazaspiro[4.5]dec-3-ene-2-thione 4-[(Z)-2,6-Dimethyl-phenylimino]-7,7-dimethyl-1-phenyl-8-oxa-1,3-diaza-spiro[4.5]decane-2-thione SMR000145863 | cid_4005418
Type:
Small organic molecule
Emp. Form.:
C23H27N3OS
Mol. Mass.:
393.545
SMILES:
Cc1cccc(C)c1NC1=NC(=S)N(c2ccccc2)C11CCOC(C)(C)C1
: