Target
Serine/threonine-protein kinase PLK1
Ligand
BDBM41826
Substrate
Meas. Tech.
Concentration Response fluorescence polarization-based assay to confirm small molecule inhibitors identified in the Polo box domain (PBD) of Plk1 Primary HTS.
IC50
>50000±n/a nM
Citation
 PubChem, PC Concentration Response fluorescence polarization-based assay to confirm small molecule inhibitors identified in the Polo box domain (PBD) of Plk1 Primary HTS. PubChem Bioassay (2007)[AID] 
Target
Name:
Serine/threonine-protein kinase PLK1
Synonyms:
PLK PLK1 Polo-like kinase 1 (PlK1) STPK13 Serine/threonine-protein kinase 13 | polo-like kinase
Type:
Serine/threonine-protein kinase
Mol. Mass.:
68277.16
Organism:
Homo sapiens (Human)
Description:
P53350
Residue:
603
  
Inhibitor
Name:
BDBM41826
Synonyms:
2-[[(4E)-1-keto-4-(2-thienylsulfonylimino)-2-naphthyl]amino]benzoic acid methyl ester MLS000521465 cid_9550941 methyl 2-[[(4E)-1-oxo-4-thiophen-2-ylsulfonyliminonaphthalen-2-yl]amino]benzoate
Type:
Small organic molecule
Emp. Form.:
C22H16N2O5S2
Mol. Mass.:
452.503
SMILES:
COC(=O)c1ccccc1NC1=CC(=NS(=O)(=O)c2cccs2)c2ccccc2C1=O
: