Target
Serine/threonine-protein kinase PLK1
Ligand
BDBM41827
Substrate
Meas. Tech.
Concentration Response fluorescence polarization-based assay to confirm small molecule inhibitors identified in the Polo box domain (PBD) of Plk1 Primary HTS.
IC50
>50000±n/a nM
Citation
 PubChem, PC Concentration Response fluorescence polarization-based assay to confirm small molecule inhibitors identified in the Polo box domain (PBD) of Plk1 Primary HTS. PubChem Bioassay (2007)[AID] 
Target
Name:
Serine/threonine-protein kinase PLK1
Synonyms:
PLK PLK1 Polo-like kinase 1 (PlK1) STPK13 Serine/threonine-protein kinase 13 | polo-like kinase
Type:
Serine/threonine-protein kinase
Mol. Mass.:
68277.16
Organism:
Homo sapiens (Human)
Description:
P53350
Residue:
603
  
Inhibitor
Name:
BDBM41827
Synonyms:
3-chloranyl-2,6-dimethyl-pyrido[1,2-a]pyrimidin-4-one 3-chloro-2,6-dimethyl-4H-pyrido[1,2-a]pyrimidin-4-one 3-chloro-2,6-dimethylpyrido[1,2-a]pyrimidin-4-one SMR000125161 | cid_3255478
Type:
Small organic molecule
Emp. Form.:
C10H9ClN2O
Mol. Mass.:
208.644
SMILES:
Cc1nc2cccc(C)n2c(=O)c1Cl
: