Target
Serine/threonine-protein kinase PLK1
Ligand
BDBM41843
Substrate
Meas. Tech.
Concentration Response fluorescence polarization-based assay to confirm small molecule inhibitors identified in the Polo box domain (PBD) of Plk1 Primary HTS.
IC50
>50000±n/a nM
Citation
 PubChem, PC Concentration Response fluorescence polarization-based assay to confirm small molecule inhibitors identified in the Polo box domain (PBD) of Plk1 Primary HTS. PubChem Bioassay (2007)[AID] 
Target
Name:
Serine/threonine-protein kinase PLK1
Synonyms:
PLK PLK1 Polo-like kinase 1 (PlK1) STPK13 Serine/threonine-protein kinase 13 | polo-like kinase
Type:
Serine/threonine-protein kinase
Mol. Mass.:
68277.16
Organism:
Homo sapiens (Human)
Description:
P53350
Residue:
603
  
Inhibitor
Name:
BDBM41843
Synonyms:
3-hydroxy-5-nitro-3-(1-piperidinyl)-1,3-dihydro-2H-indol-2-one 3-hydroxy-5-nitro-3-piperidin-1-yl-1H-indol-2-one 5-nitro-3-oxidanyl-3-piperidin-1-yl-1H-indol-2-one SMR000186733 | cid_2859373
Type:
Small organic molecule
Emp. Form.:
C13H15N3O4
Mol. Mass.:
277.2759
SMILES:
OC1(N2CCCCC2)C(=O)Nc2ccc(cc12)[N+]([O-])=O
: