Target
Serine/threonine-protein kinase PLK1
Ligand
BDBM41844
Substrate
Meas. Tech.
Concentration Response fluorescence polarization-based assay to confirm small molecule inhibitors identified in the Polo box domain (PBD) of Plk1 Primary HTS.
IC50
>50000±n/a nM
Citation
 PubChem, PC Concentration Response fluorescence polarization-based assay to confirm small molecule inhibitors identified in the Polo box domain (PBD) of Plk1 Primary HTS. PubChem Bioassay (2007)[AID] 
Target
Name:
Serine/threonine-protein kinase PLK1
Synonyms:
PLK PLK1 Polo-like kinase 1 (PlK1) STPK13 Serine/threonine-protein kinase 13 | polo-like kinase
Type:
Serine/threonine-protein kinase
Mol. Mass.:
68277.16
Organism:
Homo sapiens (Human)
Description:
P53350
Residue:
603
  
Inhibitor
Name:
BDBM41844
Synonyms:
2-[(1-ethyl-2-oxo-1,2-dihydro-3H-indol-3-ylidene)methyl]-3-phenyl-4(3H)-quinazolinone 2-[(E)-(1-ethyl-2-oxidanylidene-indol-3-ylidene)methyl]-3-phenyl-quinazolin-4-one 2-[(E)-(1-ethyl-2-oxoindol-3-ylidene)methyl]-3-phenylquinazolin-4-one SMR000186892 | cid_5336431
Type:
Small organic molecule
Emp. Form.:
C25H19N3O2
Mol. Mass.:
393.4373
SMILES:
CCN1C(=O)\C(=C\c2nc3ccccc3c(=O)n2-c2ccccc2)c2ccccc12
: