Target
Alkaline phosphatase, germ cell type
Ligand
BDBM41868
Substrate
Meas. Tech.
Luminescent assay for identification of inhibitors of human intestinal alkaline phosphatase
IC50
>100000±n/a nM
Citation
 PubChem, PC Luminescent assay for identification of inhibitors of human intestinal alkaline phosphatase PubChem Bioassay (2009)[AID] 
Target
Name:
Alkaline phosphatase, germ cell type
Synonyms:
ALPG ALPPL2 PPBN_HUMAN | placental-like alkaline phosphatase preproprotein
Type:
PROTEIN
Mol. Mass.:
57374.31
Organism:
Homo sapiens (Human)
Description:
ChEMBL_29964
Residue:
532
  
Inhibitor
Name:
BDBM41868
Synonyms:
3-phenyl-1H-pyrazole-5-carboxylic acid methyl ester cid_644585 | methyl 3-phenyl-1H-pyrazole-5-carboxylate
Type:
Small organic molecule
Emp. Form.:
C11H10N2O2
Mol. Mass.:
202.2093
SMILES:
COC(=O)c1cc(n[nH]1)-c1ccccc1
: