Target
Alkaline phosphatase, germ cell type
Ligand
BDBM41870
Substrate
Meas. Tech.
Luminescent assay for identification of inhibitors of human intestinal alkaline phosphatase
IC50
>100000±n/a nM
Citation
 PubChem, PC Luminescent assay for identification of inhibitors of human intestinal alkaline phosphatase PubChem Bioassay (2009)[AID] 
Target
Name:
Alkaline phosphatase, germ cell type
Synonyms:
ALPG ALPPL2 PPBN_HUMAN | placental-like alkaline phosphatase preproprotein
Type:
PROTEIN
Mol. Mass.:
57374.31
Organism:
Homo sapiens (Human)
Description:
ChEMBL_29964
Residue:
532
  
Inhibitor
Name:
BDBM41870
Synonyms:
2-(1H-benzimidazol-2-yl)indane-1,3-quinone MLS-0146239.0001 | cid_2836230
Type:
Small organic molecule
Emp. Form.:
C16H10N2O2
Mol. Mass.:
262.2628
SMILES:
O=C1C(C(=O)c2ccccc12)c1nc2ccccc2[nH]1
: