Target
Alkaline phosphatase, germ cell type
Ligand
BDBM41871
Substrate
Meas. Tech.
Luminescent assay for identification of inhibitors of human intestinal alkaline phosphatase
IC50
>100000±n/a nM
Citation
 PubChem, PC Luminescent assay for identification of inhibitors of human intestinal alkaline phosphatase PubChem Bioassay (2009)[AID] 
Target
Name:
Alkaline phosphatase, germ cell type
Synonyms:
ALPG ALPPL2 PPBN_HUMAN | placental-like alkaline phosphatase preproprotein
Type:
PROTEIN
Mol. Mass.:
57374.31
Organism:
Homo sapiens (Human)
Description:
ChEMBL_29964
Residue:
532
  
Inhibitor
Name:
BDBM41871
Synonyms:
2-(1,3,4-thiadiazol-2-yl)isoindole-1,3-dione MLS-0146240.0001 | cid_323349
Type:
Small organic molecule
Emp. Form.:
C10H5N3O2S
Mol. Mass.:
231.231
SMILES:
O=C1N(C(=O)c2ccccc12)c1nncs1
: