Target
Alkaline phosphatase, germ cell type
Ligand
BDBM50299523
Substrate
Meas. Tech.
Luminescent assay for identification of inhibitors of human intestinal alkaline phosphatase
IC50
>100000±n/a nM
Citation
 PubChem, PC Luminescent assay for identification of inhibitors of human intestinal alkaline phosphatase PubChem Bioassay (2009)[AID] 
Target
Name:
Alkaline phosphatase, germ cell type
Synonyms:
ALPG ALPPL2 PPBN_HUMAN | placental-like alkaline phosphatase preproprotein
Type:
PROTEIN
Mol. Mass.:
57374.31
Organism:
Homo sapiens (Human)
Description:
ChEMBL_29964
Residue:
532
  
Inhibitor
Name:
BDBM50299523
Synonyms:
2,5-Dimethoxy-N-(quinolin-3-yl)benzenesulfonamide cid_2931238
Type:
Small organic molecule
Emp. Form.:
C17H16N2O4S
Mol. Mass.:
344.385
SMILES:
COc1ccc(OC)c(c1)S(=O)(=O)Nc1cnc2ccccc2c1
: