Target
Alkaline phosphatase, germ cell type
Ligand
BDBM41894
Substrate
Meas. Tech.
Luminescent assay for identification of inhibitors of human intestinal alkaline phosphatase
IC50
13100±n/a nM
Citation
 PubChem, PC Luminescent assay for identification of inhibitors of human intestinal alkaline phosphatase PubChem Bioassay (2009)[AID] 
Target
Name:
Alkaline phosphatase, germ cell type
Synonyms:
ALPG ALPPL2 PPBN_HUMAN | placental-like alkaline phosphatase preproprotein
Type:
PROTEIN
Mol. Mass.:
57374.31
Organism:
Homo sapiens (Human)
Description:
ChEMBL_29964
Residue:
532
  
Inhibitor
Name:
BDBM41894
Synonyms:
1-(3,4-dihydroxyphenyl)-2-[[5-(3-methoxyphenyl)-4-prop-2-enyl-1,2,4-triazol-3-yl]sulfanyl]ethanone 1-[3,4-bis(oxidanyl)phenyl]-2-[[5-(3-methoxyphenyl)-4-prop-2-enyl-1,2,4-triazol-3-yl]sulfanyl]ethanone MLS-0390843.0001 | cid_1409759
Type:
Small organic molecule
Emp. Form.:
C20H19N3O4S
Mol. Mass.:
397.448
SMILES:
COc1cccc(c1)-c1nnc(SCC(=O)c2ccc(O)c(O)c2)n1CC=C
: