Target
Bifunctional epoxide hydrolase 2
Ligand
BDBM41902
Substrate
Meas. Tech.
sEH_DR_Inh_Infinite200_Fluorescence_01072008
IC50
42.2±n/a nM
Citation
 PubChem, PC sEH_DR_Inh_Infinite200_Fluorescence_01072008 PubChem Bioassay (2008)[AID] 
Target
Name:
Bifunctional epoxide hydrolase 2
Synonyms:
Cytosolic epoxide hydrolase 2 EPHX2 HYES_HUMAN Soluble epoxide hydrolase (sEH) | epoxide hydrolase 2, cytoplasmic
Type:
Enzyme
Mol. Mass.:
62613.07
Organism:
Homo sapiens (Human)
Description:
P34913
Residue:
555
  
Inhibitor
Name:
BDBM41902
Synonyms:
1-Cyclohexyl-3-[1-(2,3-dihydro-benzo[1,4]dioxine-6-sulfonyl)-piperidin-4-yl]-urea 1-cyclohexyl-3-[1-(2,3-dihydro-1,4-benzodioxin-6-ylsulfonyl)-4-piperidyl]urea MLS000034124 cid_654292
Type:
Small organic molecule
Emp. Form.:
C20H29N3O5S
Mol. Mass.:
423.526
SMILES:
O=C(NC1CCCCC1)NC1CCN(CC1)S(=O)(=O)c1ccc2OCCOc2c1
: