Target
Bifunctional epoxide hydrolase 2
Ligand
BDBM41913
Substrate
Meas. Tech.
sEH_DR_Inh_Infinite200_Fluorescence_01072008
IC50
43.5±n/a nM
Citation
 PubChem, PC sEH_DR_Inh_Infinite200_Fluorescence_01072008 PubChem Bioassay (2008)[AID] 
Target
Name:
Bifunctional epoxide hydrolase 2
Synonyms:
Cytosolic epoxide hydrolase 2 EPHX2 HYES_HUMAN Soluble epoxide hydrolase (sEH) | epoxide hydrolase 2, cytoplasmic
Type:
Enzyme
Mol. Mass.:
62613.07
Organism:
Homo sapiens (Human)
Description:
P34913
Residue:
555
  
Inhibitor
Name:
BDBM41913
Synonyms:
MLS000117851 N-(4-bromo-3-methyl-phenyl)-1-(1H-imidazol-5-ylsulfonyl)nipecotamide N-(4-bromo-3-methylphenyl)-1-(1H-imidazol-5-ylsulfonyl)piperidine-3-carboxamide cid_5307616
Type:
Small organic molecule
Emp. Form.:
C16H19BrN4O3S
Mol. Mass.:
427.316
SMILES:
Cc1cc(NC(=O)C2CCCN(C2)S(=O)(=O)c2c[nH]cn2)ccc1Br
: