Target
Bifunctional epoxide hydrolase 2
Ligand
BDBM41921
Substrate
Meas. Tech.
sEH_DR_Inh_Infinite200_Fluorescence_01072008
IC50
11.7±n/a nM
Citation
 PubChem, PC sEH_DR_Inh_Infinite200_Fluorescence_01072008 PubChem Bioassay (2008)[AID] 
Target
Name:
Bifunctional epoxide hydrolase 2
Synonyms:
Cytosolic epoxide hydrolase 2 EPHX2 HYES_HUMAN Soluble epoxide hydrolase (sEH) | epoxide hydrolase 2, cytoplasmic
Type:
Enzyme
Mol. Mass.:
62613.07
Organism:
Homo sapiens (Human)
Description:
P34913
Residue:
555
  
Inhibitor
Name:
BDBM41921
Synonyms:
1-cyclohexyl-3-cyclooctyl-urea MLS000535387 SMR000142825 cid_840783
Type:
Small organic molecule
Emp. Form.:
C15H28N2O
Mol. Mass.:
252.3956
SMILES:
O=C(NC1CCCCC1)NC1CCCCCCC1
: