Target
Bifunctional epoxide hydrolase 2
Ligand
BDBM41927
Substrate
Meas. Tech.
sEH_DR_Inh_Infinite200_Fluorescence_01072008
IC50
17.7±n/a nM
Citation
 PubChem, PC sEH_DR_Inh_Infinite200_Fluorescence_01072008 PubChem Bioassay (2008)[AID] 
Target
Name:
Bifunctional epoxide hydrolase 2
Synonyms:
Cytosolic epoxide hydrolase 2 EPHX2 HYES_HUMAN Soluble epoxide hydrolase (sEH) | epoxide hydrolase 2, cytoplasmic
Type:
Enzyme
Mol. Mass.:
62613.07
Organism:
Homo sapiens (Human)
Description:
P34913
Residue:
555
  
Inhibitor
Name:
BDBM41927
Synonyms:
MLS000570673 N-(3,3-diphenylpropyl)-2,5-dimethyl-3-furancarboxamide N-(3,3-diphenylpropyl)-2,5-dimethylfuran-3-carboxamide cid_4879946
Type:
Small organic molecule
Emp. Form.:
C22H23NO2
Mol. Mass.:
333.4235
SMILES:
Cc1cc(C(=O)NCCC(c2ccccc2)c2ccccc2)c(C)o1
: