Target
Dual specificity protein phosphatase 6
Ligand
BDBM31736
Substrate
Meas. Tech.
MKP-3 in vitro secondary assay for identification of irreversible and slow-binding inhibitors
IC50
49000±2800 nM
Citation
 PubChem, PC MKP-3 in vitro secondary assay for identification of irreversible and slow-binding inhibitors PubChem Bioassay (2008)[AID] 
Target
Name:
Dual specificity protein phosphatase 6
Synonyms:
DUS6_RAT MAP kinase phosphatase 3 Mitogen-activated protein kinase phosphatase 3 | Mkp3
Type:
Enzyme
Mol. Mass.:
42303.19
Organism:
Rattus norvegicus
Description:
gi_16758752
Residue:
381
  
Inhibitor
Name:
BDBM31736
Synonyms:
(7Z)-3-bromanyl-7-[[5-(2-nitrophenyl)furan-2-yl]methylidene]-[1,3]thiazolo[4,5]imidazo[1,2-b]pyridin-8-one (7Z)-3-bromo-7-[[5-(2-nitrophenyl)-2-furyl]methylene]thiazolo[4,5]imidazo[1,2-b]pyridin-8-one MLS-0091942.0001 | cid_5341934
Type:
Small organic molecule
Emp. Form.:
C19H9BrN4O4S
Mol. Mass.:
469.268
SMILES:
[O-][N+](=O)c1ccccc1-c1ccc(\C=c2/sc3nc4cc(Br)cnc4n3c2=O)o1
: