Target
Dual specificity protein phosphatase 6
Ligand
BDBM41956
Substrate
Meas. Tech.
MKP-3 in vitro secondary assay for identification of irreversible and slow-binding inhibitors
IC50
61600±2900 nM
Citation
 PubChem, PC MKP-3 in vitro secondary assay for identification of irreversible and slow-binding inhibitors PubChem Bioassay (2008)[AID] 
Target
Name:
Dual specificity protein phosphatase 6
Synonyms:
DUS6_RAT MAP kinase phosphatase 3 Mitogen-activated protein kinase phosphatase 3 | Mkp3
Type:
Enzyme
Mol. Mass.:
42303.19
Organism:
Rattus norvegicus
Description:
gi_16758752
Residue:
381
  
Inhibitor
Name:
BDBM41956
Synonyms:
7,9-bis(chloranyl)-3a,4,5,9b-tetrahydro-3H-cyclopenta[c]quinoline-4-carboxylic acid MLS-0091953.0001 | cid_2914772
Type:
Small organic molecule
Emp. Form.:
C13H11Cl2NO2
Mol. Mass.:
284.138
SMILES:
OC(=O)C1Nc2cc(Cl)cc(Cl)c2C2C=CCC12
: