Target
Mothers against decapentaplegic homolog 3
Ligand
BDBM41958
Substrate
Meas. Tech.
SMAD Transcription Factor Inhibitors Secondary Dose Response Confirmation
IC50
1770±n/a nM
Citation
 PubChem, PC SMAD Transcription Factor Inhibitors Secondary Dose Response Confirmation PubChem Bioassay (2008)[AID] 
Target
Name:
Mothers against decapentaplegic homolog 3
Synonyms:
MADH3 SMAD3_HUMAN
Type:
Enzyme Catalytic Domain
Mol. Mass.:
48085.78
Organism:
Homo sapiens (Human)
Description:
gi_5174513
Residue:
425
  
Inhibitor
Name:
BDBM41958
Synonyms:
5-hydroxy-1H-indole-2-carboxylic acid cid_88958
Type:
Small organic molecule
Emp. Form.:
C9H7NO3
Mol. Mass.:
177.1568
SMILES:
OC(=O)c1cc2cc(O)ccc2[nH]1
: