Target
Mothers against decapentaplegic homolog 3
Ligand
BDBM41960
Substrate
Meas. Tech.
SMAD Transcription Factor Inhibitors Secondary Dose Response Confirmation
IC50
>50000±n/a nM
Citation
 PubChem, PC SMAD Transcription Factor Inhibitors Secondary Dose Response Confirmation PubChem Bioassay (2008)[AID] 
Target
Name:
Mothers against decapentaplegic homolog 3
Synonyms:
MADH3 SMAD3_HUMAN
Type:
Enzyme Catalytic Domain
Mol. Mass.:
48085.78
Organism:
Homo sapiens (Human)
Description:
gi_5174513
Residue:
425
  
Inhibitor
Name:
BDBM41960
Synonyms:
2-(3,4,5-trihydroxy-6-keto-8a,9-dihydroxanthen-9-yl)benzoic acid methyl ester TG2-194 methyl 2-(3,4,5-trihydroxy-6-oxo-8a,9-dihydroxanthen-9-yl)benzoate | methyl 2-[3,4,5-tris(oxidanyl)-6-oxidanylidene-8a,9-dihydroxanthen-9-yl]benzoate
Type:
Small organic molecule
Emp. Form.:
C21H16O7
Mol. Mass.:
380.3475
SMILES:
COC(=O)c1ccccc1C1C2C=CC(=O)C(=O)C2Oc2c(O)c(O)ccc12
: