Target
Mothers against decapentaplegic homolog 3
Ligand
BDBM41984
Substrate
Meas. Tech.
SMAD Transcription Factor Inhibitors Secondary Dose Response Confirmation
IC50
>40000±n/a nM
Citation
 PubChem, PC SMAD Transcription Factor Inhibitors Secondary Dose Response Confirmation PubChem Bioassay (2008)[AID] 
Target
Name:
Mothers against decapentaplegic homolog 3
Synonyms:
MADH3 SMAD3_HUMAN
Type:
Enzyme Catalytic Domain
Mol. Mass.:
48085.78
Organism:
Homo sapiens (Human)
Description:
gi_5174513
Residue:
425
  
Inhibitor
Name:
BDBM41984
Synonyms:
6-[1,3-benzodioxol-5-yl(1-piperidinyl)methyl]-1,3-benzodioxol-5-ol 6-[1,3-benzodioxol-5-yl(piperidino)methyl]sesamol | cid_339888
Type:
Small organic molecule
Emp. Form.:
C20H21NO5
Mol. Mass.:
355.3844
SMILES:
Oc1cc2OCOc2cc1C(N1CCCCC1)c1ccc2OCOc2c1
: