Target
Bcl-2-related protein A1
Ligand
BDBM34194
Substrate
Meas. Tech.
In Vitro Bfl-1 Dose Response Fluorescence Polarization Assay for SAR Study
IC50
362±200 nM
Citation
 PubChem, PC In Vitro Bfl-1 Dose Response Fluorescence Polarization Assay for SAR Study PubChem Bioassay (2008)[AID] 
Target
Name:
Bcl-2-related protein A1
Synonyms:
A1 B-cell leukemia/lymphoma 2 related protein A1a Bcl2a1 Bfl-1 Hemopoietic-specific early response protein | Protein BFL-1
Type:
Apoptosis regulator protein
Mol. Mass.:
19909.74
Organism:
Mus musculus (Mouse)
Description:
gi_11024684
Residue:
172
  
Inhibitor
Name:
BDBM34194
Synonyms:
3-chloranyl-1-(3,4-dichlorophenyl)-4-(4-methylpiperazin-1-yl)pyrrole-2,5-dione 3-chloro-1-(3,4-dichlorophenyl)-4-(4-methylpiperazin-1-yl)pyrrole-2,5-dione MLS000110530 SMR000106459 | cid_1180676
Type:
Small organic molecule
Emp. Form.:
C15H14Cl3N3O2
Mol. Mass.:
374.65
SMILES:
CN1CCN(CC1)C1=C(Cl)C(=O)N(C1=O)c1ccc(Cl)c(Cl)c1
: