Target
Bcl-2-related protein A1
Ligand
BDBM39140
Substrate
Meas. Tech.
In Vitro Bfl-1 Dose Response Fluorescence Polarization Assay for SAR Study
IC50
13400±1670 nM
Citation
 PubChem, PC In Vitro Bfl-1 Dose Response Fluorescence Polarization Assay for SAR Study PubChem Bioassay (2008)[AID] 
Target
Name:
Bcl-2-related protein A1
Synonyms:
A1 B-cell leukemia/lymphoma 2 related protein A1a Bcl2a1 Bfl-1 Hemopoietic-specific early response protein | Protein BFL-1
Type:
Apoptosis regulator protein
Mol. Mass.:
19909.74
Organism:
Mus musculus (Mouse)
Description:
gi_11024684
Residue:
172
  
Inhibitor
Name:
BDBM39140
Synonyms:
1-[2,6-bis(chloranyl)phenyl]-3-chloranyl-4-(4-methylpiperazin-1-yl)pyrrole-2,5-dione 3-chloro-1-(2,6-dichlorophenyl)-4-(4-methylpiperazin-1-yl)pyrrole-2,5-dione MLS-0090830.0001 | cid_16654637
Type:
Small organic molecule
Emp. Form.:
C15H14Cl3N3O2
Mol. Mass.:
374.65
SMILES:
CN1CCN(CC1)C1=C(Cl)C(=O)N(C1=O)c1c(Cl)cccc1Cl
: