Target
Bcl-2-related protein A1
Ligand
BDBM39153
Substrate
Meas. Tech.
In Vitro Bfl-1 Dose Response Fluorescence Polarization Assay for SAR Study
IC50
1900±290 nM
Citation
 PubChem, PC In Vitro Bfl-1 Dose Response Fluorescence Polarization Assay for SAR Study PubChem Bioassay (2008)[AID] 
Target
Name:
Bcl-2-related protein A1
Synonyms:
A1 B-cell leukemia/lymphoma 2 related protein A1a Bcl2a1 Bfl-1 Hemopoietic-specific early response protein | Protein BFL-1
Type:
Apoptosis regulator protein
Mol. Mass.:
19909.74
Organism:
Mus musculus (Mouse)
Description:
gi_11024684
Residue:
172
  
Inhibitor
Name:
BDBM39153
Synonyms:
3-chloranyl-1-(3,4-dichlorophenyl)-4-(4-pyrimidin-2-ylpiperazin-1-yl)pyrrole-2,5-dione 3-chloro-1-(3,4-dichlorophenyl)-4-[4-(2-pyrimidinyl)-1-piperazinyl]pyrrole-2,5-dione MLS-0090868.0001 | cid_16654664
Type:
Small organic molecule
Emp. Form.:
C18H14Cl3N5O2
Mol. Mass.:
438.695
SMILES:
ClC1=C(N2CCN(CC2)c2ncccn2)C(=O)N(C1=O)c1ccc(Cl)c(Cl)c1
: