Target
Heat shock 70 kDa protein 1A
Ligand
BDBM41956
Substrate
Meas. Tech.
In Vitro Hsp70 Dose Response Fluorescence Polarization Assay for SAR Study
IC50
18100±1140 nM
Citation
 PubChem, PC In Vitro Hsp70 Dose Response Fluorescence Polarization Assay for SAR Study PubChem Bioassay (2008)[AID] 
Target
Name:
Heat shock 70 kDa protein 1A
Synonyms:
HSPA1A V9GZ37_HUMAN | heat shock 70kDa protein 1A
Type:
ATP-binding protein
Mol. Mass.:
51937.99
Organism:
Homo sapiens (Human)
Description:
gi_123271505; GST-tagged ATPase domain
Residue:
476
  
Inhibitor
Name:
BDBM41956
Synonyms:
7,9-bis(chloranyl)-3a,4,5,9b-tetrahydro-3H-cyclopenta[c]quinoline-4-carboxylic acid MLS-0091953.0001 | cid_2914772
Type:
Small organic molecule
Emp. Form.:
C13H11Cl2NO2
Mol. Mass.:
284.138
SMILES:
OC(=O)C1Nc2cc(Cl)cc(Cl)c2C2C=CCC12
: