Target
Heat shock 70 kDa protein 1A
Ligand
BDBM31748
Substrate
Meas. Tech.
In Vitro Hsp70 Dose Response Fluorescence Polarization Assay for SAR Study
IC50
22400±1890 nM
Citation
 PubChem, PC In Vitro Hsp70 Dose Response Fluorescence Polarization Assay for SAR Study PubChem Bioassay (2008)[AID] 
Target
Name:
Heat shock 70 kDa protein 1A
Synonyms:
HSPA1A V9GZ37_HUMAN | heat shock 70kDa protein 1A
Type:
ATP-binding protein
Mol. Mass.:
51937.99
Organism:
Homo sapiens (Human)
Description:
gi_123271505; GST-tagged ATPase domain
Residue:
476
  
Inhibitor
Name:
BDBM31748
Synonyms:
8-chloranyl-9-nitro-6-oxidanyl-3a,4,5,9b-tetrahydro-3H-cyclopenta[c]quinoline-4-carboxylic acid MLS-0111541.0001 cid_3453217
Type:
Small organic molecule
Emp. Form.:
C13H11ClN2O5
Mol. Mass.:
310.69
SMILES:
OC(=O)C1Nc2c(O)cc(Cl)c(c2C2C=CCC12)[N+]([O-])=O
: