Target
Estrogen receptor
Ligand
BDBM42007
Substrate
Meas. Tech.
Estrogen Receptor-alpha Coactivator Binding Inhibitors ELISA Secondary Assay
IC50
2360±n/a nM
Citation
 PubChem, PC Estrogen Receptor-alpha Coactivator Binding Inhibitors ELISA Secondary Assay PubChem Bioassay (2008)[AID] 
Target
Name:
Estrogen receptor
Synonyms:
ER ESR ESR1_HUMAN Estrogen receptor Estrogen receptor (ER-alpha) Estrogen receptor alpha (ER) Nuclear receptor subfamily 3 group A member 1
Type:
Protein
Mol. Mass.:
66230.44
Organism:
Homo sapiens (Human)
Description:
P03372
Residue:
595
  
Inhibitor
Name:
BDBM42007
Synonyms:
3-[4-[4-(3-chlorophenyl)-1-piperazinyl]-4-oxobutyl]-6,7-dimethoxy-2-sulfanylidene-1H-quinazolin-4-one 3-[4-[4-(3-chlorophenyl)piperazin-1-yl]-4-oxobutyl]-6,7-dimethoxy-2-sulfanylidene-1H-quinazolin-4-one AS-927-43b | cid_24178255
Type:
Small organic molecule
Emp. Form.:
C24H27ClN4O4S
Mol. Mass.:
503.014
SMILES:
COc1cc2[nH]c(=S)n(CCCC(=O)N3CCN(CC3)c3cccc(Cl)c3)c(=O)c2cc1OC
: