Target
Estrogen receptor
Ligand
BDBM42010
Substrate
Meas. Tech.
Estrogen Receptor-alpha Coactivator Binding Inhibitors ELISA Secondary Assay
IC50
70±n/a nM
Citation
 PubChem, PC Estrogen Receptor-alpha Coactivator Binding Inhibitors ELISA Secondary Assay PubChem Bioassay (2008)[AID] 
Target
Name:
Estrogen receptor
Synonyms:
ER ESR ESR1_HUMAN Estrogen receptor Estrogen receptor (ER-alpha) Estrogen receptor alpha (ER) Nuclear receptor subfamily 3 group A member 1
Type:
Protein
Mol. Mass.:
66230.44
Organism:
Homo sapiens (Human)
Description:
P03372
Residue:
595
  
Inhibitor
Name:
BDBM42010
Synonyms:
3-[4-[4-(2-hydroxyphenyl)-1-piperazinyl]-4-oxobutyl]-2-sulfanylidene-1H-quinazolin-4-one 3-[4-[4-(2-hydroxyphenyl)piperazin-1-yl]-4-oxobutyl]-2-sulfanylidene-1H-quinazolin-4-one AS-920-37a | cid_24178258
Type:
Small organic molecule
Emp. Form.:
C22H24N4O3S
Mol. Mass.:
424.516
SMILES:
Oc1ccccc1N1CCN(CC1)C(=O)CCCn1c(=S)[nH]c2ccccc2c1=O
: