Target
Estrogen receptor
Ligand
BDBM42017
Substrate
Meas. Tech.
Estrogen Receptor-alpha Coactivator Binding Inhibitors ELISA Secondary Assay
IC50
840±n/a nM
Citation
 PubChem, PC Estrogen Receptor-alpha Coactivator Binding Inhibitors ELISA Secondary Assay PubChem Bioassay (2008)[AID] 
Target
Name:
Estrogen receptor
Synonyms:
ER ESR ESR1_HUMAN Estrogen receptor Estrogen receptor (ER-alpha) Estrogen receptor alpha (ER) Nuclear receptor subfamily 3 group A member 1
Type:
Protein
Mol. Mass.:
66230.44
Organism:
Homo sapiens (Human)
Description:
P03372
Residue:
595
  
Inhibitor
Name:
BDBM42017
Synonyms:
3-[6-[4-(3-nitrophenyl)-1-piperazinyl]-6-oxohexyl]-2-sulfanylidene-1H-quinazolin-4-one 3-[6-[4-(3-nitrophenyl)piperazin-1-yl]-6-oxohexyl]-2-sulfanylidene-1H-quinazolin-4-one As-1024-61a | cid_24178281
Type:
Small organic molecule
Emp. Form.:
C24H27N5O4S
Mol. Mass.:
481.567
SMILES:
[O-][N+](=O)c1cccc(c1)N1CCN(CC1)C(=O)CCCCCn1c(=S)[nH]c2ccccc2c1=O
: